FreeBSD-main-amd64-test - Build #25886 - Still Unstable
Date: Mon, 13 Jan 2025 09:23:48 UTC
FreeBSD-main-amd64-test - Build #25886 (0749d8134300b8e3c956e161890ab496247d2542) - Still Unstable
Build information: https://ci.FreeBSD.org/job/FreeBSD-main-amd64-test/25886/
Full change log: https://ci.FreeBSD.org/job/FreeBSD-main-amd64-test/25886/changes
Full build log: https://ci.FreeBSD.org/job/FreeBSD-main-amd64-test/25886/console
Status explanation:
"Unstable" - some tests are suspected being broken by the following changes
"Still Unstable" - the failing test cases have not been fixed by these
following changes and this is a notification to note that
these changes have not been fully tested by the CI system
Change summaries:
(Those commits are likely but not certainly responsible)
0749d8134300b8e3c956e161890ab496247d2542 by kp:
pf tests: check cleared time when zeroing stats for table addresses
The failed test cases:
4 tests failed.
FAILED: lib.csu.dynamiclib.cxx_constructors.__test_cases_list__
Error Message:
Test program did not exit cleanly
FAILED: lib.csu.dynamiclib.fini_test.__test_cases_list__
Error Message:
Test program did not exit cleanly
FAILED: lib.csu.dynamiclib.init_test.__test_cases_list__
Error Message:
Test program did not exit cleanly
FAILED: sys.net.routing.test_routing_l3.py.TestIfOps::test_change_prefix_route[inet]
Error Message:
/usr/tests/sys/net/routing/test_routing_l3.py:42: AssertionError