FreeBSD-stable-14-amd64-test - Build #860 - Still unstable
Date: Thu, 09 Jan 2025 05:52:53 UTC
FreeBSD-stable-14-amd64-test - Build #860 (5403bb70cf34ade6a32f760260d38dfa6ecf07c1) - Still unstable
Build information: https://ci.FreeBSD.org/job/FreeBSD-stable-14-amd64-test/860/
Full change log: https://ci.FreeBSD.org/job/FreeBSD-stable-14-amd64-test/860/changes
Full build log: https://ci.FreeBSD.org/job/FreeBSD-stable-14-amd64-test/860/console
Status explanation:
"Unstable" - some tests are suspected being broken by the following changes
"Still Unstable" - the failing test cases have not been fixed by these
following changes and this is a notification to note that
these changes have not been fully tested by the CI system
Change summaries:
(Those commits are likely but not certainly responsible)
e34dce0f7be4cfb39c369ec1cf1fa6145f02e5ac by jhb:
pci_user.c: Cosmetic fixes
4425d92a8044a82b8eac48b3131802d96aaf91f2 by jhb:
socket: Move SO_SPLICE next to other socket option constants
836ed5bc2b6f3ad8100a846464d7a31de9ad3136 by jhb:
ccr(4): Mention geli(4) and ktls(4) as other consumers
35135bb0870f4680c25df8662135118f27acb669 by jhb:
ccr(4): Belatedly bump .Dd for prior commit
9a15a1fef95e96ce2434adc76835c862a9e336ce by jhb:
manuals: Misc macro typos
66cb373c8fa249f737ca23574ce8df2791111f9d by jhb:
procctl.2: Editing pass
334e641d3861a866817a91a85b0bc3ec76936799 by jhb:
fgets.3: document gets_s() __STDC_WANT_LIB_EXT1__
000823559af9a890cbe90958470e937c2425903f by jhb:
find: Re-enable the -acl primary on FreeBSD
32b7c5e7193ad051b637262b6c7cb315478609d1 by jhb:
cd9660: Apply the file and directory mode masks bits to all 12 access
18a9da18ad2caf1c99a4002678573a43352092e4 by jhb:
mount_cd9660.8: Bump .Dd for expanding mode mask bits
1e87d76855adf09da89700cb33f27acde6839741 by jhb:
cxgbe tom: Restore support for zerocopy TCP receive for aio_read()
5403bb70cf34ade6a32f760260d38dfa6ecf07c1 by jhb:
timeradd.3: Add missing .Pp after .Ed
The failed test cases:
6 tests failed.
FAILED: sys.netpfil.common.dummynet.pf_queue
Error Message:
We failed prioritisation 1 times
FAILED: sys.kern.sigsys.sigsys_test_off
Error Message:
/usr/src/tests/sys/kern/sigsys.c:70: sysctlbyname(name, &oldval, &oldlen, NULL, 0) == 0 not met
FAILED: sys.kern.sigsys.sigsys_test_on
Error Message:
/usr/src/tests/sys/kern/sigsys.c:70: sysctlbyname(name, &oldval, &oldlen, NULL, 0) == 0 not met
FAILED: usr.bin.grep.grep_test.recurse_symlink
Error Message:
atf-check failed; see the output of the test for details
FAILED: sys.netmap.ctrl-api-test.main
Error Message:
Returned non-success exit status 255
FAILED: sys.netlink.test_netlink_message_writer.py.__test_cases_list__
Error Message:
Test program did not exit cleanly