FreeBSD-stable-14-amd64-test - Build #1371 - Still Unstable
Date: Mon, 25 Aug 2025 17:46:56 UTC
FreeBSD-stable-14-amd64-test - Build #1371 (17d87881a363c160e7e8cdb252d0261214c1a50b) - Still Unstable
Build information: https://ci.FreeBSD.org/job/FreeBSD-stable-14-amd64-test/1371/
Full change log: https://ci.FreeBSD.org/job/FreeBSD-stable-14-amd64-test/1371/changes
Full build log: https://ci.FreeBSD.org/job/FreeBSD-stable-14-amd64-test/1371/console
Status explanation:
"Unstable" - some tests are suspected being broken by the following changes
"Still Unstable" - the failing test cases have not been fixed by these
following changes and this is a notification to note that
these changes have not been fully tested by the CI system
Change summaries:
(Those commits are likely but not certainly responsible)
10bb227a7d10cbdc859473424cc0c1ab0adbf503 by markj:
vfs: Move DEBUG_VFS_LOCKS checks to INVARIANTS
a58eb4d233bfdddff243faec071f8dc18d3e5492 by markj:
lib: Fix calls that naively set F_SETFD.
d033848a5e4ca02b20c55b8e8601c57087dafb81 by markj:
ufs: Remove uses of DEBUG_VFS_LOCKS
b532d0509b715858ac7381c3d8f260c010595419 by markj:
tmpfs: Remove uses of DEBUG_VFS_LOCKS
765b8ef6991c317b4172f3ebc2db21beb8168627 by markj:
mac: Remove uses of DEBUG_VFS_LOCKS
88fff9ee28476ae00536bcc5b9cfdd37185143ae by markj:
vnode_pager: Remove uses of DEBUG_VFS_LOCKS
d9ddd261ef3e746704385889a38d275a32284de4 by markj:
vm_page: Clear VM_ALLOC_NOCREAT in vm_page_grab_pflags()
58022811d35382ffe48ab6b1edc4984c800f9841 by markj:
libdtrace: Permit taking the address of an identifier without type info
8fbaa731d538fcbea8144d843b3d71037503cc78 by markj:
makefs/zfs: Make it possible to set a compression property
b681da5c8d8b8bfac0a91401545776fe8f1919ae by markj:
makefs/zfs: Allow the user to specify the pool GUID
5b42aac0013afa760a8071cdf16c70786c5802b9 by markj:
makefs/zfs tests: Run in parallel
17d87881a363c160e7e8cdb252d0261214c1a50b by markj:
arm64: prevent panic when using syscall mux + large arg call (mmap)
The failed test cases:
5 tests failed.
FAILED: sys.geom.class.gate.ggate_test.ggated
Error Message:
atf-check failed; see the output of the test for details
FAILED: sys.net.if_ovpn.if_ovpn.float
Error Message:
Client not found in status list!
FAILED: sys.net.if_ovpn.if_ovpn.linklocal
Error Message:
atf-check failed; see the output of the test for details
FAILED: sys.netinet.fibs_test.same_ip_multiple_ifaces_fib0
Error Message:
atf-check failed; see the output of the test for details
FAILED: sys.netlink.test_netlink_message_writer.py.__test_cases_list__
Error Message:
Test program did not exit cleanly