FreeBSD-stable-14-amd64-test - Build #1364 - Still Unstable

From: <jenkins-admin_at_FreeBSD.org>
Date: Fri, 22 Aug 2025 07:47:53 UTC
FreeBSD-stable-14-amd64-test - Build #1364 (a4e9f8567708a6e67bb634b3168c7fdca560e663) - Still Unstable

Build information: https://ci.FreeBSD.org/job/FreeBSD-stable-14-amd64-test/1364/
Full change log: https://ci.FreeBSD.org/job/FreeBSD-stable-14-amd64-test/1364/changes
Full build log: https://ci.FreeBSD.org/job/FreeBSD-stable-14-amd64-test/1364/console

Status explanation:
"Unstable" - some tests are suspected being broken by the following changes
"Still Unstable" - the failing test cases have not been fixed by these
                   following changes and this is a notification to note that
                   these changes have not been fully tested by the CI system

Change summaries:
(Those commits are likely but not certainly responsible)

4e8ac151bca92afbca258718a689d30a87e49d31 by gbe:
bnxt(4): Fix typos in a comment and a kernel message

a4e9f8567708a6e67bb634b3168c7fdca560e663 by gbe:
arm: Fix two typos in kernel messages of pmu_fdt.c



The failed test cases:

5 tests failed.
FAILED:  sys.geom.class.gate.ggate_test.ggated

Error Message:
atf-check failed; see the output of the test for details

FAILED:  sys.net.if_ovpn.if_ovpn.float

Error Message:
Client not found in status list!

FAILED:  sys.net.if_ovpn.if_ovpn.linklocal

Error Message:
atf-check failed; see the output of the test for details

FAILED:  sys.netinet.fibs_test.same_ip_multiple_ifaces_fib0

Error Message:
atf-check failed; see the output of the test for details

FAILED:  sys.netlink.test_netlink_message_writer.py.__test_cases_list__

Error Message:
Test program did not exit cleanly