FreeBSD-main-amd64-test - Build #26268 - Still unstable

From: <jenkins-admin_at_FreeBSD.org>
Date: Thu, 17 Apr 2025 06:10:00 UTC
FreeBSD-main-amd64-test - Build #26268 (8c3aac52f5efe80720f35c578a9644609000a99c) - Still unstable

Build information: https://ci.FreeBSD.org/job/FreeBSD-main-amd64-test/26268/
Full change log: https://ci.FreeBSD.org/job/FreeBSD-main-amd64-test/26268/changes
Full build log: https://ci.FreeBSD.org/job/FreeBSD-main-amd64-test/26268/console

Status explanation:
"Unstable" - some tests are suspected being broken by the following changes
"Still Unstable" - the failing test cases have not been fixed by these
                   following changes and this is a notification to note that
                   these changes have not been fully tested by the CI system

Change summaries:
(Those commits are likely but not certainly responsible)

7a4c662f407f074287f42cf0652dff74a294bf0e by bapt:
termcap: add entry for Alacritty

b3884193b7bd3977acc44790b6278b60517ad097 by bapt:
libedit: import snapshort 2025-01-03

9b397d784bcfff49f467b879f0d425412d55b094 by bapt:
pci_vendors: update to 2025-03-09

8c3aac52f5efe80720f35c578a9644609000a99c by bapt:
usb_vendors: update to 2025-04-01



The failed test cases:

3 tests failed.
FAILED:  bin.pwait.pwait_test.time_unit

Error Message:
atf-check failed; see the output of the test for details

FAILED:  sys.netinet.broadcast.INADDR_BROADCAST

Error Message:
/usr/src/tests/sys/netinet/broadcast.c:65: sending of broadcast failed: 51

FAILED:  sys.netinet.fibs_test.same_ip_multiple_ifaces_fib0

Error Message:
atf-check failed; see the output of the test for details