FreeBSD-main-amd64-test - Build #26194 - Still Unstable
Date: Wed, 02 Apr 2025 02:00:25 UTC
FreeBSD-main-amd64-test - Build #26194 (45f70f98fc55b753b1e7a7374b4a061aa1f27392) - Still Unstable
Build information: https://ci.FreeBSD.org/job/FreeBSD-main-amd64-test/26194/
Full change log: https://ci.FreeBSD.org/job/FreeBSD-main-amd64-test/26194/changes
Full build log: https://ci.FreeBSD.org/job/FreeBSD-main-amd64-test/26194/console
Status explanation:
"Unstable" - some tests are suspected being broken by the following changes
"Still Unstable" - the failing test cases have not been fixed by these
following changes and this is a notification to note that
these changes have not been fully tested by the CI system
Change summaries:
(Those commits are likely but not certainly responsible)
45f70f98fc55b753b1e7a7374b4a061aa1f27392 by kib:
iommu_gas_map_region(): add comment explaining the ma array shift
The failed test cases:
8 tests failed.
FAILED: lib.libc.net.getaddrinfo.getaddrinfo.basic
Error Message:
/usr/src/lib/libc/tests/net/getaddrinfo/getaddrinfo.c:94: Expected 0, got 2 (Name could not be resolved at this time)
FAILED: lib.libc.net.getaddrinfo.getaddrinfo.nofamily
Error Message:
/usr/src/lib/libc/tests/net/getaddrinfo/getaddrinfo.c:224: Expected 1 (EAI_ADDRFAMILY), got 2 (Name could not be resolved at this time)
FAILED: lib.libc.net.getaddrinfo.getaddrinfo_test.basic
Error Message:
Test case body returned a non-ok exit code, but this is not allowed
FAILED: lib.libc.net.getaddrinfo.getaddrinfo_test.empty_servname
Error Message:
Test case body returned a non-ok exit code, but this is not allowed
FAILED: lib.libc.net.getaddrinfo.getaddrinfo_test.sock_raw
Error Message:
Test case body returned a non-ok exit code, but this is not allowed
FAILED: sys.kern.ktrace_test.ktrace__cap_sockaddr
Error Message:
/usr/src/tests/sys/kern/ktrace_test.c:133: WEXITSTATUS(error) != status
FAILED: sys.netinet.broadcast.INADDR_BROADCAST
Error Message:
/usr/src/tests/sys/netinet/broadcast.c:65: sending of broadcast failed: 51
FAILED: sys.netinet.fibs_test.same_ip_multiple_ifaces_fib0
Error Message:
atf-check failed; see the output of the test for details