FreeBSD-main-amd64-test - Build #25238 - Still Unstable

From: <>
Date: Tue, 14 May 2024 17:22:51 UTC
FreeBSD-main-amd64-test - Build #25238 (305db91d4b92a5d53826dcb6df39fc8a1f3b427e) - Still Unstable

Build information:
Full change log:
Full build log:

Status explanation:
"Unstable" - some tests are suspected being broken by the following changes
"Still Unstable" - the failing test cases have not been fixed by these
                   following changes and this is a notification to note that
                   these changes have not been fully tested by the CI system

Change summaries:
(Those commits are likely but not certainly responsible)

663838451ec64ddea872b0916e56d599839093fb by oshogbo:
syscalls: regen

58d7ac11e77db28640b8e47f9f9c1fe81d15baf5 by kib:
tmpfs: recalculate OBJ_TMPFS_VREF on reinstantiating node' vnode

6ada4e8a0ae901f0012015c8d277d80aad7d8f37 by kib:
swap-like pagers: assert that writemapping decrease does not pass zero

46811949797b7e44521cd56cfa61b6c8378c4600 by kib:
tmpfs_destroy_vobject(): clear v_object under the object lock

e90259af59a1363126062442d80ba48678926369 by oshogbo:

01fc488381e97c0bf589a297caa0c4b8e6b3e1c4 by jhb:
nvme: Use strlcpy instead of strncpy to ensure termination

da4230af3fda2d4d1898124689f2e07b1450876d by jhb:
nvme/f: Use strlcpy instead of strncpy + manual string termination

5a178b831a9fe8c51e406355f0164d01627cf1f4 by imp:
nvme: Add locking asserts

9db8ca92b98588e705f4d021e934edd60c51fb98 by imp:
nvme: Slight reworking this loop to match FreeBSD style

c931cf6af08b7d0abb29c90917dfe79a18235897 by imp:
nvme: Slight simplification

0dd84c3b117a01fdcac9a2f665fb156a2e358dfa by imp:
nvme: Add comment about where tr->deadline is set

0ed58ac88a865610e982416af505a5948d1c88c9 by kevans:
include: ssp: kill off leftover $FreeBSD$ tag

dec211c6cf60dcaefcd1bd93eb50825179d3060f by kevans:
Stop removing ssp headers

27358245644c2a8bf2b57182e2fcd8cdf18d6b8d by jrm:
freebsd-tips: Add fortune to find font providing Unicode character

338d53965d9f4bfb1a83c1bcff3ff78944ce3a9f by kib:
x86: Add Intel TD/HFI related MSR/CPUID defines to specialregs.h

d9f1f0a901831ff960380fe82a2abe99a3721f87 by zlei:
boottrace: Use NULL for SYSINIT's last arg, which is a pointer type

3c2ab5fddc576e58f3ffa70dc5fa95144646a513 by sjg:
Import bmake-20240508

b5a1f0406b9d6bba28e57377dcfc8b83bce987ad by dougm:
arm64_pmap: narrow scope of bti_same test

847ef59d4b5eab234bd1f8eb947ad74bdab5614e by des:
ifconfig: Add format shortcuts.

5681636ead6790d5ad2c24a4712f010fcdfc926c by bapt:
nuageinit: by default to not enable nuageinit

b0b9435ef1ec64c21f7243dbd02ad10e7f612149 by bapt:
pci_vendors: update to 2024.05.14

79bffdf3f42e2e8e62223fcffd537d5d254ddbb7 by bapt:
usb_vendors: update to 2024.03.18

54cc353f505dbc5f19168b6b1417b6736433d9ae by christos:
snd_hda: Add patch for Lenovo Ideapad 3

278953360e0e6187c3f7c688cb49254df1567f0b by christos:
snd_hda: Rename LENOVO_I* to LENOVO_IDEAPAD*

305db91d4b92a5d53826dcb6df39fc8a1f3b427e by christos:
sound: Remove ncards variable from sound_oss_card_info()

The failed test cases:

3 tests failed.
FAILED:  sys.netpfil.common.dummynet.pf_queue

Error Message:
We failed prioritisation 1 times

FAILED:  sys.kern.unix_seqpacket_test.random_eor_and_waitall

Error Message:
/usr/src/tests/sys/kern/unix_seqpacket_test.c:1182: send(params->sock, &params->sendbuf[off], len, flags) == len not met

FAILED:  sys.netinet6.divert.ipdivert_ip6_output_remote_success

Error Message:
1 != 0 (1 != 0)