FreeBSD-main-amd64-test - Build #25204 - Still Unstable

From: <>
Date: Thu, 02 May 2024 03:10:02 UTC
FreeBSD-main-amd64-test - Build #25204 (b07689d1f2a268317bead0d785407b2f7dd7de78) - Still Unstable

Build information:
Full change log:
Full build log:

Status explanation:
"Unstable" - some tests are suspected being broken by the following changes
"Still Unstable" - the failing test cases have not been fixed by these
                   following changes and this is a notification to note that
                   these changes have not been fully tested by the CI system

Change summaries:
(Those commits are likely but not certainly responsible)

b07689d1f2a268317bead0d785407b2f7dd7de78 by emaste:
beinstall: retire mergemaster support

The failed test cases:

3 tests failed.
FAILED:  sys.geom.class.gate.ggate_test.ggated

Error Message:
atf-check failed; see the output of the test for details

FAILED:  sys.kern.unix_seqpacket_test.random_eor_and_waitall

Error Message:
/usr/src/tests/sys/kern/unix_seqpacket_test.c:1182: send(params->sock, &params->sendbuf[off], len, flags) == len not met

FAILED:  sys.netinet6.divert.ipdivert_ip6_output_remote_success

Error Message:
1 != 0 (1 != 0)