FreeBSD-stable-14-amd64-test - Build #459 - Still Unstable

From: <>
Date: Sun, 31 Mar 2024 23:32:50 UTC
FreeBSD-stable-14-amd64-test - Build #459 (36d16f5c5b5018bbd5060f679ce120453a6a6567) - Still Unstable

Build information:
Full change log:
Full build log:

Status explanation:
"Unstable" - some tests are suspected being broken by the following changes
"Still Unstable" - the failing test cases have not been fixed by these
                   following changes and this is a notification to note that
                   these changes have not been fully tested by the CI system

Change summaries:
(Those commits are likely but not certainly responsible)

cde0347ca70b1ffc49803a1fe6c38f8b83135ddc by kib:
cdevpriv(9): add iterator

36d16f5c5b5018bbd5060f679ce120453a6a6567 by kib:
cdevpriv(9): document devfs_foreach_cdevpriv()

The failed test cases:

4 tests failed.
FAILED:  sys.netpfil.common.dummynet.pf_queue

Error Message:
We failed prioritisation 1 times

FAILED:  sys.netpfil.common.forward.pf_v4

Error Message:
atf-check failed; see the output of the test for details

FAILED:  sys.fs.tmpfs.times_test.empty

Error Message:
Test case was expecting a failure but none were raised


Error Message:
Test program did not exit cleanly