FreeBSD-main-amd64-test - Build #25011 - Still Unstable

From: <>
Date: Sun, 31 Mar 2024 01:30:56 UTC
FreeBSD-main-amd64-test - Build #25011 (3f2b9607756d0f92ca29c844db0718b313a06634) - Still Unstable

Build information:
Full change log:
Full build log:

Status explanation:
"Unstable" - some tests are suspected being broken by the following changes
"Still Unstable" - the failing test cases have not been fixed by these
                   following changes and this is a notification to note that
                   these changes have not been fully tested by the CI system

Change summaries:
(Those commits are likely but not certainly responsible)

1bfe195143ffb6832ac6702e281964541554fcb3 by glebius:
pfilctl: fix 'pfilctl hooks' when nothing is connected

3f2b9607756d0f92ca29c844db0718b313a06634 by glebius:
vtnet: set VNET context in RX handler

The failed test cases:

3 tests failed.
FAILED:  sys.netinet6.lpm6.lpm6_test1_success

Error Message:
atf-check failed; see the output of the test for details

FAILED:  sys.fs.tmpfs.times_test.empty

Error Message:
Test case was expecting a failure but none were raised

FAILED:  cddl.usr.sbin.zfsd.zfsd_unittest.main

Error Message:
Received signal 6