FreeBSD-stable-14-amd64-test - Build #457 - Still Unstable

From: <>
Date: Sun, 31 Mar 2024 00:55:11 UTC
FreeBSD-stable-14-amd64-test - Build #457 (d9d05e65c1f7dd5c39a180ebc1f806482cb875e0) - Still Unstable

Build information:
Full change log:
Full build log:

Status explanation:
"Unstable" - some tests are suspected being broken by the following changes
"Still Unstable" - the failing test cases have not been fixed by these
                   following changes and this is a notification to note that
                   these changes have not been fully tested by the CI system

Change summaries:
(Those commits are likely but not certainly responsible)

ad9aa0685925a1297fc7683e2a178dec419fe3e6 by markj:
ktrace: Add __ktrace_used

3ba61343f708ba9edabe9e3b2a2e4467bfabd2c9 by markj:
ktrace: Fix the build when options KTRACE is not configured

15e12749ef1dd55a18a7b1e5672e2b75f1bde68b by markj:
ossl: Add support for armv7

3166bb7c107deb82236d875701f55d1940ee0e27 by markj:
ossl: Add AES-GCM support for NEON-enabled armv7

0b9dffed30bad28cf9b9d356480f38065db3051f by markj:
ossl: Move arm_arch.h to a common subdirectory

955e13a3e2a84dabe3b11b7c80bf25eaec1e50c5 by markj:
ossl: Remove a stray __FBSDID("$FreeBSD$")

43ae86aa8e24af1419b21bc1b1d76c113fdcc4d1 by markj:
conf: Expand the include path for more openssl files

683947e13fb8fdf5bee443cedd1b916238619998 by markj:
bhyve: Add support for XML register definitions

b41151b96de6fdab7b762dcf8d3f6640639c4bf3 by markj:
bhyve/gdb: Avoid rebuilding target.xml for install targets

b78edde280528102d66d55058d3e287e24800e51 by markj:
libfdt: Make an internal FDT library available

2b4745d2c193bede4b887f882e302c02c1f300ef by markj:
bhyve: Move device model-independent UART code into a separate file

4ede1bc00bbc45beb535b939180c29c73a6d7344 by markj:
build: Order kernel-toolchain and buildkernel targets

df4a9902eac75c31dd8857e94b9aadd8c88cae03 by markj:
rc.initdiskless: Disable soft-updates in mdmfs (again)

d9d05e65c1f7dd5c39a180ebc1f806482cb875e0 by khng:
epoch(9): Remove the under-development note

The failed test cases:

4 tests failed.
FAILED:  sys.netinet.forward.fwd_ip_icmp_iface_fast_success

Error Message:
atf-check failed; see the output of the test for details

FAILED:  sys.netinet6.ndp.ndp_del_gu_success

Error Message:
atf-check failed; see the output of the test for details

FAILED:  sys.fs.tmpfs.times_test.empty

Error Message:
Test case was expecting a failure but none were raised


Error Message:
Test program did not exit cleanly