FreeBSD-main-amd64-test - Build #25009 - Still Unstable

From: <>
Date: Sat, 30 Mar 2024 01:38:45 UTC
FreeBSD-main-amd64-test - Build #25009 (a983cea4e9a8dcd52cfd6a3141d7aa03306b057b) - Still Unstable

Build information:
Full change log:
Full build log:

Status explanation:
"Unstable" - some tests are suspected being broken by the following changes
"Still Unstable" - the failing test cases have not been fixed by these
                   following changes and this is a notification to note that
                   these changes have not been fully tested by the CI system

Change summaries:
(Those commits are likely but not certainly responsible)

a983cea4e9a8dcd52cfd6a3141d7aa03306b057b by kp:
pf: fix reply-to after rdr and dummynet

The failed test cases:

3 tests failed.
FAILED:  sys.netpfil.common.dummynet.pf_pls_gilbert

Error Message:
atf-check failed; see the output of the test for details

FAILED:  sys.fs.tmpfs.times_test.empty

Error Message:
Test case was expecting a failure but none were raised

FAILED:  cddl.usr.sbin.zfsd.zfsd_unittest.main

Error Message:
Received signal 6