FreeBSD-main-amd64-test - Build #25003 - Still Unstable

From: <>
Date: Thu, 28 Mar 2024 09:12:10 UTC
FreeBSD-main-amd64-test - Build #25003 (c92400a6f690a82ab84eb0b97cc8bf169e44e4e8) - Still Unstable

Build information:
Full change log:
Full build log:

Status explanation:
"Unstable" - some tests are suspected being broken by the following changes
"Still Unstable" - the failing test cases have not been fixed by these
                   following changes and this is a notification to note that
                   these changes have not been fully tested by the CI system

Change summaries:
(Those commits are likely but not certainly responsible)

c92400a6f690a82ab84eb0b97cc8bf169e44e4e8 by emaste:
dma.conf: Fix typo

The failed test cases:

3 tests failed.
FAILED:  usr.sbin.syslogd.syslogd_test.pipe_action

Error Message:
atf-check failed; see the output of the test for details

FAILED:  sys.fs.tmpfs.times_test.empty

Error Message:
Test case was expecting a failure but none were raised

FAILED:  cddl.usr.sbin.zfsd.zfsd_unittest.main

Error Message:
Received signal 6