FreeBSD-main-amd64-test - Build #24976 - Still Unstable

From: <>
Date: Fri, 22 Mar 2024 21:19:12 UTC
FreeBSD-main-amd64-test - Build #24976 (312a05c39e5fd79b37ee6f922462232797f56a2a) - Still Unstable

Build information:
Full change log:
Full build log:

Status explanation:
"Unstable" - some tests are suspected being broken by the following changes
"Still Unstable" - the failing test cases have not been fixed by these
                   following changes and this is a notification to note that
                   these changes have not been fully tested by the CI system

Change summaries:
(Those commits are likely but not certainly responsible)

1947a9383ec3a048e334022365aa199a6ae55289 by brooks:
msun/riscv: expose fe{disable,enable}except

312a05c39e5fd79b37ee6f922462232797f56a2a by brooks:
riscv: remove more riscv64sf support

The failed test cases:

3 tests failed.
FAILED:  sys.netpfil.common.dummynet.pf_pls_gilbert

Error Message:
atf-check failed; see the output of the test for details

FAILED:  sys.fs.tmpfs.times_test.empty

Error Message:
Test case was expecting a failure but none were raised

FAILED:  cddl.usr.sbin.zfsd.zfsd_unittest.main

Error Message:
Received signal 6