FreeBSD-main-amd64-test - Build #24966 - Still Unstable

From: <>
Date: Wed, 20 Mar 2024 13:01:34 UTC
FreeBSD-main-amd64-test - Build #24966 (45d83c39262d9e2727c6f409e19c653f19a5d7cc) - Still Unstable

Build information:
Full change log:
Full build log:

Status explanation:
"Unstable" - some tests are suspected being broken by the following changes
"Still Unstable" - the failing test cases have not been fixed by these
                   following changes and this is a notification to note that
                   these changes have not been fully tested by the CI system

Change summaries:
(Those commits are likely but not certainly responsible)

45d83c39262d9e2727c6f409e19c653f19a5d7cc by bapt:
pkgbase: add a mechanism to be able to force a give ucl include

The failed test cases:

3 tests failed.
FAILED:  sys.capsicum.functional.test_unprivileged

Error Message:
atf-check failed; see the output of the test for details

FAILED:  sys.fs.tmpfs.times_test.empty

Error Message:
Test case was expecting a failure but none were raised

FAILED:  cddl.usr.sbin.zfsd.zfsd_unittest.main

Error Message:
Received signal 6