FreeBSD-main-amd64-test - Build #24964 - Still Unstable

From: <>
Date: Wed, 20 Mar 2024 03:54:05 UTC
FreeBSD-main-amd64-test - Build #24964 (e07d37c7056a549ce1ed5dd0dfdbeadfe1b82605) - Still Unstable

Build information:
Full change log:
Full build log:

Status explanation:
"Unstable" - some tests are suspected being broken by the following changes
"Still Unstable" - the failing test cases have not been fixed by these
                   following changes and this is a notification to note that
                   these changes have not been fully tested by the CI system

Change summaries:
(Those commits are likely but not certainly responsible)

a1e516a731e3d45e10dab65bb8ccb0484f316d55 by cperciva:
arm64: Move curthread setup earlier

fba329a195e8cfd52a0c59314d40f0143f32af10 by brooks:
Define stack_t in sys/_sigaltstack.h

694ef157b9b755b13fb724ef02b7964f59008d8c by brooks:
freebsd32: freebsd32_copyinuio takes const iovp

128443a9f2b21df4bc844faa3a7288cd081d18c7 by brooks:
syscalls.master: fix readv and writev iovp decl

d8d4ed26c92de27cf883d05fddb97a0c23123215 by brooks:
syscall.master: fix aio_suspend signature

7936d4e4d082136b54994da0ac1246967a899f2a by brooks:
syscalls.master: align with sigfastblock declaration

d060b420e0f6d8f6535dfcda6f580dad3f5613d3 by brooks:
freebsd32: struct siginfo32 -> struct __siginfo32

cab73e530564b814a7f95945e42c05f1d2dcc1f4 by brooks:
syscalls.master: struct siginfo -> struct __siginfo

d0efabdf15d956e9bc0414356ed798ca3c846e08 by brooks:
syscalls.master: make __sys_fcntl take an intptr_t

55513a1b6e4b46cc5f19bbf35980ff0db874a93b by brooks:
sys/acl.h: move main typedefs to sys/_types.h

27676ae365f62c22f8daa816bf7a07d22bd081d9 by brooks:
syscalls.master: use __acl_type_t

e07d37c7056a549ce1ed5dd0dfdbeadfe1b82605 by brooks:
sysent: regen

The failed test cases:

3 tests failed.
FAILED:  sys.netpfil.common.dummynet.pf_pls_gilbert

Error Message:
atf-check failed; see the output of the test for details

FAILED:  sys.fs.tmpfs.times_test.empty

Error Message:
Test case was expecting a failure but none were raised

FAILED:  cddl.usr.sbin.zfsd.zfsd_unittest.main

Error Message:
Received signal 6