FreeBSD-main-amd64-test - Build #24962 - Still Unstable

From: <>
Date: Tue, 19 Mar 2024 19:14:37 UTC
FreeBSD-main-amd64-test - Build #24962 (470a2b3346612fbf2f6415ec8df63c92703035dd) - Still Unstable

Build information:
Full change log:
Full build log:

Status explanation:
"Unstable" - some tests are suspected being broken by the following changes
"Still Unstable" - the failing test cases have not been fixed by these
                   following changes and this is a notification to note that
                   these changes have not been fully tested by the CI system

Change summaries:
(Those commits are likely but not certainly responsible)

02b25ccfc0b13759ce04c291b6569dcfa22a9fa0 by bapt:
pkgbase: fix packaging of dtb

0ea0c026557b46292881d5a75babeb3cc0fd9696 by kp:
pf: avoid passing through dummynet multiple times

c6f1116357904d3c2e95430e27213e4d0948fc64 by kp:
pf: fix dummynet + route-to

470a2b3346612fbf2f6415ec8df63c92703035dd by kp:
pf: convert DIOCSETSTATUSIF to netlink

The failed test cases:

3 tests failed.
FAILED:  sys.netpfil.common.dummynet.ipfw_pls_gilbert

Error Message:
atf-check failed; see the output of the test for details

FAILED:  sys.fs.tmpfs.times_test.empty

Error Message:
Test case was expecting a failure but none were raised

FAILED:  cddl.usr.sbin.zfsd.zfsd_unittest.main

Error Message:
Received signal 6