FreeBSD-main-amd64-test - Build #24951 - Still Unstable

From: <>
Date: Sun, 17 Mar 2024 16:28:11 UTC
FreeBSD-main-amd64-test - Build #24951 (1e4cd5ed54d73dcb8e9af92990e7bf005b9a5710) - Still Unstable

Build information:
Full change log:
Full build log:

Status explanation:
"Unstable" - some tests are suspected being broken by the following changes
"Still Unstable" - the failing test cases have not been fixed by these
                   following changes and this is a notification to note that
                   these changes have not been fully tested by the CI system

Change summaries:
(Those commits are likely but not certainly responsible)

1e4cd5ed54d73dcb8e9af92990e7bf005b9a5710 by emaste:
release: remove binutils package data

The failed test cases:

3 tests failed.
FAILED:  sys.fs.fusefs.last_local_modify.main

Error Message:
Returned non-success exit status 1

FAILED:  sys.fs.tmpfs.times_test.empty

Error Message:
Test case was expecting a failure but none were raised

FAILED:  cddl.usr.sbin.zfsd.zfsd_unittest.main

Error Message:
Received signal 6