FreeBSD-main-amd64-test - Build #24939 - Still Unstable

From: <>
Date: Thu, 14 Mar 2024 06:16:15 UTC
FreeBSD-main-amd64-test - Build #24939 (63a7c4be4ad524629292eee659d6542f1c5e9c21) - Still Unstable

Build information:
Full change log:
Full build log:

Status explanation:
"Unstable" - some tests are suspected being broken by the following changes
"Still Unstable" - the failing test cases have not been fixed by these
                   following changes and this is a notification to note that
                   these changes have not been fully tested by the CI system

Change summaries:
(Those commits are likely but not certainly responsible)

b30a80b65587fb9fd4a5f012d606dbd0c6239a46 by jhb:
rman: Add rman_get/set_type

1b9bcffff39a817b77401d1b975f374781adfaf8 by jhb:
sys: Set the type of allocated bus resources

9edb8d0aedef2f1e13ed1f8134deb3f8291d2fe9 by jhb:
new-bus: Introduce a simpler bus API for managing resources

0ecee1602e195933a39da65d34440399129e19fb by jhb:
acpi: Use rman_get_type in acpi_is_resource_managed

3351964c5e5d29ef93b3f26b7fc31a4972aa9af7 by jhb:
bhnd: Use rman_get_type in bhndb_find_resource_limits

582b84cd252d56f06556134b1103da3a0425fdbd by jhb:
pcib: Use rman_get_type in internal functions

fef01f0498aa7b256bc37bbf28ee0e8ac9b2536f by jhb:
new-bus: Remove the 'type' argument from BUS_ADJUST_RESOURCE

d77f2092ceebaba115e6be53410428f6f5f6ae83 by jhb:
new-bus: Remove the 'type' argument from BUS_MAP/UNMAP_RESOURCE

2baed46e85d33b1f99e6f96033acc85a9a6fbba4 by jhb:
new-bus: Remove the 'rid' and 'type' arguments from

9dbf5b0e6876d8c93890754bcc9c748339de79c0 by jhb:
new-bus: Remove the 'rid' and 'type' arguments from BUS_RELEASE_RESOURCE

a7b9f4d96e8bdc30db27ec7a193a8d8fdf7c652c by jhb:
Bump __FreeBSD_version for bus resource API change

220ee18f196482c534a659d1eb50db26c54ca7d0 by kib:
netinet/tcp_var.h: always define IS_FASTOPEN() for kernel compilation

63a7c4be4ad524629292eee659d6542f1c5e9c21 by mp:
hyperv/hn: Don't return error when setting media to autoselect

The failed test cases:

3 tests failed.
FAILED:  sys.netinet6.ndp.ndp_del_gu_success

Error Message:
atf-check failed; see the output of the test for details

FAILED:  sys.netpfil.common.dummynet.pf_queue

Error Message:
We failed prioritisation 2 times

FAILED:  cddl.usr.sbin.zfsd.zfsd_unittest.main

Error Message:
Received signal 6