FreeBSD-main-amd64-test - Build #24672 - Still Unstable

From: <>
Date: Mon, 15 Jan 2024 02:30:19 UTC
FreeBSD-main-amd64-test - Build #24672 (53df7e58cca7e6726b44f447f10ddc3451cfa851) - Still Unstable

Build information:
Full change log:
Full build log:

Status explanation:
"Unstable" - some tests are suspected being broken by the following changes
"Still Unstable" - the failing test cases have not been fixed by these
                   following changes and this is a notification to note that
                   these changes have not been fully tested by the CI system

Change summaries:
(Those commits are likely but not certainly responsible)

03e8d25b1f9218dcd52d13819dda14dbbaf622b7 by marius:
geom_map(4): Garbage collect disconnected driver

53df7e58cca7e6726b44f447f10ddc3451cfa851 by marius:
geom_redboot(4): Garbage collect disconnected driver

The failed test cases:

3 tests failed.
FAILED:  sys.netinet6.ndp.ndp_del_gu_success

Error Message:
atf-check failed; see the output of the test for details

FAILED:  sys.kern.shutdown_dgram.unblock

Error Message:
Test case body timed out

FAILED:  sys.kern.unix_passfd_dgram.send_and_shutdown

Error Message:
/usr/src/tests/sys/kern/unix_passfd_test.c:431: openfiles() == nfiles - 1 not met