FreeBSD-main-amd64-test - Build #24664 - Still Unstable

From: <>
Date: Sat, 13 Jan 2024 19:26:44 UTC
FreeBSD-main-amd64-test - Build #24664 (e3c7b76fa8105929ae9a785e5ffc44274b1b0a81) - Still Unstable

Build information:
Full change log:
Full build log:

Status explanation:
"Unstable" - some tests are suspected being broken by the following changes
"Still Unstable" - the failing test cases have not been fixed by these
                   following changes and this is a notification to note that
                   these changes have not been fully tested by the CI system

Change summaries:
(Those commits are likely but not certainly responsible)

e3c7b76fa8105929ae9a785e5ffc44274b1b0a81 by wosch:
man(1): support spaces in filenames

The failed test cases:

3 tests failed.
FAILED:  sys.netpfil.common.dummynet.ipfw_pls_gilbert

Error Message:
atf-check failed; see the output of the test for details

FAILED:  sys.kern.shutdown_dgram.unblock

Error Message:
Test case body timed out

FAILED:  sys.kern.unix_passfd_dgram.send_and_shutdown

Error Message:
/usr/src/tests/sys/kern/unix_passfd_test.c:431: openfiles() == nfiles - 1 not met