FreeBSD-main-amd64-test - Build #24650 - Still Unstable

From: <>
Date: Wed, 10 Jan 2024 14:04:10 UTC
FreeBSD-main-amd64-test - Build #24650 (f552d7adebb13e24f65276a6c4822bffeeac3993) - Still Unstable

Build information:
Full change log:
Full build log:

Status explanation:
"Unstable" - some tests are suspected being broken by the following changes
"Still Unstable" - the failing test cases have not been fixed by these
                   following changes and this is a notification to note that
                   these changes have not been fully tested by the CI system

Change summaries:
(Those commits are likely but not certainly responsible)

7b89149c9f120e2fb1c08e7f903a0c671340fabd by noreply:
Linux 6.2 compat: add check for kernel_neon_* availability

9e0d12e3100af9dad313d11b42495fbca1aa9e2d by noreply:
ZIL: Update Linux tracing after #15635

bd3f90c0c1db570aeebda52c3413662863f9129e by noreply:
zpoolprops.7: Remove unnecessary .Ns

7ecaa0758005a56fa579c87a84a2a25ccd61033e by noreply:
make zdb_decompress_block check decompression reliably

255741fc9755186975d3c2b60ee2be4027800778 by noreply:
Improve block sizes checks during cloning

e78aca3b332da945f0becb3575ff51208a55fff2 by noreply:
Fix livelist assertions for dedup and cloning

a382e21194c1690951d2eee8ebd98bc096f01c83 by noreply:
Add Gotify notification support to ZED

The failed test cases:

4 tests failed.
FAILED:  sys.netinet6.lpm6.lpm6_test1_success

Error Message:
atf-check failed; see the output of the test for details

FAILED:  sys.netlink.netlink_socket.membership

Error Message:
/usr/src/tests/sys/netlink/netlink_socket.c:300: recv(fd, &msg, sizeof(msg), 0) == sizeof(msg) not met

FAILED:  sys.kern.unix_passfd_dgram.send_and_shutdown

Error Message:
/usr/src/tests/sys/kern/unix_passfd_test.c:431: openfiles() == nfiles - 1 not met


Error Message:
Test case body timed out