FreeBSD-main-amd64-test - Build #24830 - Still unstable

From: <>
Date: Wed, 28 Feb 2024 12:13:26 UTC
FreeBSD-main-amd64-test - Build #24830 (1365bb722af1365baee6ea1e3d44917533908d53) - Still unstable

Build information:
Full change log:
Full build log:

Status explanation:
"Unstable" - some tests are suspected being broken by the following changes
"Still Unstable" - the failing test cases have not been fixed by these
                   following changes and this is a notification to note that
                   these changes have not been fully tested by the CI system

Change summaries:
(Those commits are likely but not certainly responsible)

1365bb722af1365baee6ea1e3d44917533908d53 by des:
tzcode: Fix overflow handling in TZ parser.

The failed test cases:

4 tests failed.
FAILED:  sys.kern.ptrace_test.ptrace__follow_fork_child_detached_unrelated_debugger

Error Message:
/usr/src/tests/sys/kern/ptrace_test.c:591: WIFSTOPPED(status) not met

FAILED:  sys.audit.file-close.closefrom_success

Error Message:
Test case body timed out

FAILED:  sys.kern.fdgrowtable_test.oldtables_shared_via_threads

Error Message:
Test case body timed out


Error Message:
atf-check failed; see the output of the test for details