FreeBSD-main-amd64-test - Build #25190 - Still Unstable

From: <>
Date: Tue, 30 Apr 2024 21:16:38 UTC
FreeBSD-main-amd64-test - Build #25190 (397d8f3c36484d512d8582fa3ab6ff68e2c8cec3) - Still Unstable

Build information:
Full change log:
Full build log:

Status explanation:
"Unstable" - some tests are suspected being broken by the following changes
"Still Unstable" - the failing test cases have not been fixed by these
                   following changes and this is a notification to note that
                   these changes have not been fully tested by the CI system

Change summaries:
(Those commits are likely but not certainly responsible)

397d8f3c36484d512d8582fa3ab6ff68e2c8cec3 by brooks:
libsys: don't try to expose freebsd7___semctl

The failed test cases:

3 tests failed.
FAILED:  sys.netpfil.common.dummynet.ipfw_pls_gilbert

Error Message:
atf-check failed; see the output of the test for details

FAILED:  sys.kern.unix_seqpacket_test.random_eor_and_waitall

Error Message:
/usr/src/tests/sys/kern/unix_seqpacket_test.c:1182: send(params->sock, &params->sendbuf[off], len, flags) == len not met

FAILED:  sys.netinet6.divert.ipdivert_ip6_output_remote_success

Error Message:
1 != 0 (1 != 0)