FreeBSD-main-amd64-test - Build #25186 - Still Unstable

From: <>
Date: Tue, 30 Apr 2024 15:15:27 UTC
FreeBSD-main-amd64-test - Build #25186 (c0b58e65deca1e5e2c434ede7e64f03af6044be8) - Still Unstable

Build information:
Full change log:
Full build log:

Status explanation:
"Unstable" - some tests are suspected being broken by the following changes
"Still Unstable" - the failing test cases have not been fixed by these
                   following changes and this is a notification to note that
                   these changes have not been fully tested by the CI system

Change summaries:
(Those commits are likely but not certainly responsible)

ed3e9886422ff7ce308803a62c5ab68c3ca1ef3b by mm:
Update vendor/libarchive to libarchive master 83e8b0ea8

The failed test cases:

3 tests failed.
FAILED:  sys.fs.fusefs.getattr.main

Error Message:
Test case timed out

FAILED:  sys.kern.unix_seqpacket_test.random_eor_and_waitall

Error Message:
/usr/src/tests/sys/kern/unix_seqpacket_test.c:1182: send(params->sock, &params->sendbuf[off], len, flags) == len not met

FAILED:  sys.netinet6.divert.ipdivert_ip6_output_remote_success

Error Message:
1 != 0 (1 != 0)