FreeBSD-main-amd64-test - Build #25183 - Still Unstable

From: <>
Date: Tue, 30 Apr 2024 10:25:16 UTC
FreeBSD-main-amd64-test - Build #25183 (5b3e5c6ce3e552dae3e84d6bc781bc9f53c22d71) - Still Unstable

Build information:
Full change log:
Full build log:

Status explanation:
"Unstable" - some tests are suspected being broken by the following changes
"Still Unstable" - the failing test cases have not been fixed by these
                   following changes and this is a notification to note that
                   these changes have not been fully tested by the CI system

Change summaries:
(Those commits are likely but not certainly responsible)

1e01650a787028fd558e8cb709c232e335fc2cd9 by kib:
kcmp_pget(): add an assert that we did not hold the current process

5b3e5c6ce3e552dae3e84d6bc781bc9f53c22d71 by kib:
kcmp_pget(): do not accept TIDs

The failed test cases:

3 tests failed.
FAILED:  usr.bin.unzip.functional_test.test_I

Error Message:
atf-check failed; see the output of the test for details

FAILED:  sys.kern.unix_seqpacket_test.random_eor_and_waitall

Error Message:
/usr/src/tests/sys/kern/unix_seqpacket_test.c:1182: send(params->sock, &params->sendbuf[off], len, flags) == len not met

FAILED:  sys.netinet6.divert.ipdivert_ip6_output_remote_success

Error Message:
1 != 0 (1 != 0)