FreeBSD-main-amd64-test - Build #25175 - Still Unstable

From: <>
Date: Mon, 29 Apr 2024 15:39:01 UTC
FreeBSD-main-amd64-test - Build #25175 (9e8618276fada5c68cc64676fba2ae2abd0544f5) - Still Unstable

Build information:
Full change log:
Full build log:

Status explanation:
"Unstable" - some tests are suspected being broken by the following changes
"Still Unstable" - the failing test cases have not been fixed by these
                   following changes and this is a notification to note that
                   these changes have not been fully tested by the CI system

Change summaries:
(Those commits are likely but not certainly responsible)

d6f77d3cfa8e56aed99e2ea250fdb242f51747df by mm:
Update vendor/libarchive to 3.7.4

51c823ac2777784a4eac71d113e8c82c08482bb6 by mm:
Cherry-pick commits from libarchive to vendor/libarchive

c28253ecde333c9908b7160664805acc3a92e2b0 by des:
libulog: Make sure ut_line, ut_user, ut_host are terminated.

9e8618276fada5c68cc64676fba2ae2abd0544f5 by des:
adduser: Really fix a syntax error

The failed test cases:

3 tests failed.
FAILED:  usr.bin.unzip.functional_test.test_I

Error Message:
atf-check failed; see the output of the test for details

FAILED:  sys.kern.unix_seqpacket_test.random_eor_and_waitall

Error Message:
/usr/src/tests/sys/kern/unix_seqpacket_test.c:1182: send(params->sock, &params->sendbuf[off], len, flags) == len not met

FAILED:  sys.netinet6.divert.ipdivert_ip6_output_remote_success

Error Message:
1 != 0 (1 != 0)