FreeBSD-main-amd64-test - Build #25173 - Still Unstable

From: <>
Date: Mon, 29 Apr 2024 03:57:09 UTC
FreeBSD-main-amd64-test - Build #25173 (993d1fad5bd805dbd1820975e58839ff4276e7b0) - Still Unstable

Build information:
Full change log:
Full build log:

Status explanation:
"Unstable" - some tests are suspected being broken by the following changes
"Still Unstable" - the failing test cases have not been fixed by these
                   following changes and this is a notification to note that
                   these changes have not been fully tested by the CI system

Change summaries:
(Those commits are likely but not certainly responsible)

56ee5fc43c40479e2651b21862e299bcf73017ae by kib:
rtld snprintf: do not erronously skip a char at the buffer boundary

074d6fbebc160222cde6b726adcc7350881d7824 by christos:
sound: Fix NULL dereference in dsp_clone() and mixer_clone()

b18b990d8e7b15d25243d85ea22374dfdde8a18b by christos:
sound: Wrap dsp_clone() and mixer_clone() with bus_topo_lock()

03614fcba25b9de99e69819bc4690f66a3d24438 by christos:
sound: Fix panic caused by sleeping-channel destruction during

fa284525499d75955525839074bf5968d0923e6b by christos:
sound: Assert that we do not enter chn_sleep() with CHN_F_SLEEPING

25723d66369fe6786e9e4f5f77381b944755f267 by christos:
sound: Retire unit.*

b3ea087c05d8c75978a302cbb3fa92ce1afa3e49 by christos:
sound: Merge pcm_chn_destroy() and chn_kill()

a24050e2b784e13561da3ab731a1db92f2e3366c by christos:
sound: Move pcm_chnref() and pcm_chnrelease() to pcm/channel.c

e56c8996fc437488686e7cdef18258f16c5ea74e by christos:
sound: Add missing space in dev.pcm.X.mode description

7cc1afc5589000ac6ad7a908b07fad3401367bd1 by christos:
sound: Remove chn_timeout check from chn_init()

993d1fad5bd805dbd1820975e58839ff4276e7b0 by christos:
RELNOTES: Fix wrong commit hash

The failed test cases:

3 tests failed.
FAILED:  usr.bin.unzip.functional_test.test_I

Error Message:
atf-check failed; see the output of the test for details

FAILED:  sys.kern.unix_seqpacket_test.random_eor_and_waitall

Error Message:
/usr/src/tests/sys/kern/unix_seqpacket_test.c:1182: send(params->sock, &params->sendbuf[off], len, flags) == len not met

FAILED:  sys.netinet6.divert.ipdivert_ip6_output_remote_success

Error Message:
1 != 0 (1 != 0)