FreeBSD-main-amd64-test - Build #25168 - Still Unstable

From: <>
Date: Sun, 28 Apr 2024 00:38:23 UTC
FreeBSD-main-amd64-test - Build #25168 (6e74b603fc021761c0a20e08f58b674f45ad5f04) - Still Unstable

Build information:
Full change log:
Full build log:

Status explanation:
"Unstable" - some tests are suspected being broken by the following changes
"Still Unstable" - the failing test cases have not been fixed by these
                   following changes and this is a notification to note that
                   these changes have not been fully tested by the CI system

Change summaries:
(Those commits are likely but not certainly responsible)

6e74b603fc021761c0a20e08f58b674f45ad5f04 by fernape:
uuidgen(1): Add EXAMPLES to manual page

The failed test cases:

3 tests failed.
FAILED:  usr.bin.unzip.functional_test.test_I

Error Message:
atf-check failed; see the output of the test for details

FAILED:  sys.kern.unix_seqpacket_test.random_eor_and_waitall

Error Message:
/usr/src/tests/sys/kern/unix_seqpacket_test.c:1182: send(params->sock, &params->sendbuf[off], len, flags) == len not met

FAILED:  sys.netinet6.divert.ipdivert_ip6_output_remote_success

Error Message:
1 != 0 (1 != 0)