FreeBSD-main-amd64-test - Build #25165 - Still Unstable

From: <>
Date: Fri, 26 Apr 2024 21:05:32 UTC
FreeBSD-main-amd64-test - Build #25165 (8ceac8e13dccbe4e177c8f2f443b87b7d2e3edb3) - Still Unstable

Build information:
Full change log:
Full build log:

Status explanation:
"Unstable" - some tests are suspected being broken by the following changes
"Still Unstable" - the failing test cases have not been fixed by these
                   following changes and this is a notification to note that
                   these changes have not been fully tested by the CI system

Change summaries:
(Those commits are likely but not certainly responsible)

4459abe334eb4dbd416fa8094a64afc065ccd1cc by kevans:
script: minor style improvements

8ceac8e13dccbe4e177c8f2f443b87b7d2e3edb3 by kevans:
script: handle terminal resize on SIGWINCH

The failed test cases:

4 tests failed.
FAILED:  sys.fs.fusefs.last_local_modify.main

Error Message:
Returned non-success exit status 1

FAILED:  usr.bin.unzip.functional_test.test_I

Error Message:
atf-check failed; see the output of the test for details

FAILED:  sys.kern.unix_seqpacket_test.random_eor_and_waitall

Error Message:
/usr/src/tests/sys/kern/unix_seqpacket_test.c:1182: send(params->sock, &params->sendbuf[off], len, flags) == len not met

FAILED:  sys.netinet6.divert.ipdivert_ip6_output_remote_success

Error Message:
1 != 0 (1 != 0)