FreeBSD-main-amd64-test - Build #25161 - Still Unstable

From: <>
Date: Fri, 26 Apr 2024 07:27:44 UTC
FreeBSD-main-amd64-test - Build #25161 (6251027c4252edb3b8f8fc359a40e610349e9af3) - Still Unstable

Build information:
Full change log:
Full build log:

Status explanation:
"Unstable" - some tests are suspected being broken by the following changes
"Still Unstable" - the failing test cases have not been fixed by these
                   following changes and this is a notification to note that
                   these changes have not been fully tested by the CI system

Change summaries:
(Those commits are likely but not certainly responsible)

f0e59ecff85d4b9e875464199e065a269c9c2530 by imp:
CTL: READ(6) should be allowed on CD devices

6251027c4252edb3b8f8fc359a40e610349e9af3 by rmacklem:
nfscl: Do not use nfso_own for delayed nfsrpc_doclose()

The failed test cases:

3 tests failed.
FAILED:  usr.bin.unzip.functional_test.test_I

Error Message:
atf-check failed; see the output of the test for details

FAILED:  sys.kern.unix_seqpacket_test.random_eor_and_waitall

Error Message:
/usr/src/tests/sys/kern/unix_seqpacket_test.c:1182: send(params->sock, &params->sendbuf[off], len, flags) == len not met

FAILED:  sys.netinet6.divert.ipdivert_ip6_output_remote_success

Error Message:
1 != 0 (1 != 0)