FreeBSD-main-amd64-test - Build #25148 - Still unstable

From: <>
Date: Tue, 23 Apr 2024 10:47:56 UTC
FreeBSD-main-amd64-test - Build #25148 (74adb39cf2a545e966390c9d7df85cd514db0130) - Still unstable

Build information:
Full change log:
Full build log:

Status explanation:
"Unstable" - some tests are suspected being broken by the following changes
"Still Unstable" - the failing test cases have not been fixed by these
                   following changes and this is a notification to note that
                   these changes have not been fully tested by the CI system

Change summaries:
(Those commits are likely but not certainly responsible)

50ecbc5142e1c58f2132b351da19c5e4aa5f4e6a by imp:
libipsec: make const-correct

ca63710d3668cf6f3cb4faf065d8b4eeffa028ad by imp:
linux: ignore setsockopt(IPV6_RECVERR)

6ca1f3de57692994a57acb7632cc4cbfdcac6241 by imp:
package: move hv_{vss,kvp}_daemon into hyperv-tools

7209444a80fd37de0e19c7cf93623f84709827e3 by imp:
package: move cron into its own package

8aaa58ada45e830fc4ca12418e5262e84b87b648 by imp:
package: add DESC and COMMENT for cron package

c3dd71ab4c1c1edac99eae505dae1d5628a03ab8 by imp:
share/examples: move examples into appropriate packages

e96d0d7468446d7cabd76ae213889297711bb144 by imp:
umount: Support partitions & slices with -d option

05a95d19cb248203acdd4e069d3eedfe597c3b49 by imp:
alc(4): disable MSI-X by default on Killer cards

f578d0199761136e82850d8f086b8806f2dbad8d by imp:
ifconfig tunnelfib is implemented in wg(4)

bac2eea13ae3e4dc8fd2aec261b2a18930138495 by imp:
swab.c(libc): use a simplified version of byte swapping

74adb39cf2a545e966390c9d7df85cd514db0130 by imp:
zfsbootcfg(8), zpool_influxdb(8): move to the zfs package

The failed test cases:

3 tests failed.
FAILED:  usr.bin.unzip.functional_test.test_I

Error Message:
atf-check failed; see the output of the test for details

FAILED:  sys.kern.unix_seqpacket_test.random_eor_and_waitall

Error Message:
/usr/src/tests/sys/kern/unix_seqpacket_test.c:1182: send(params->sock, &params->sendbuf[off], len, flags) == len not met

FAILED:  sys.netinet6.divert.ipdivert_ip6_output_remote_success

Error Message:
1 != 0 (1 != 0)