FreeBSD-main-amd64-test - Build #25135 - Still Unstable

From: <>
Date: Fri, 19 Apr 2024 23:35:05 UTC
FreeBSD-main-amd64-test - Build #25135 (68a3a7fc94833020403190c20bd9be186c6156ce) - Still Unstable

Build information:
Full change log:
Full build log:

Status explanation:
"Unstable" - some tests are suspected being broken by the following changes
"Still Unstable" - the failing test cases have not been fixed by these
                   following changes and this is a notification to note that
                   these changes have not been fully tested by the CI system

Change summaries:
(Those commits are likely but not certainly responsible)

563c72e2137cb8cb9eb0eabf78319e8fe9c8aedd by bz:
LinuxKPI: utsname.h add missing SPDX-License-Identifier

2f44f86575f9cba5da28b762c359f7a806400744 by markj:
install: Fix a compiler warning when bootstrapping

2cb0fce24d64039090dc9243cdf0715ee80c91b1 by markj:
bpf: Make BPF interop consistent with if_loop

e1e636193db45630c7881246d25902e57c43d24e by markj:
tests: move atf_python/sys/ into the tests package

87b0195ace1a71a1a07244890be3aaef72e1ffcd by markj:
ctags: Use C99 bool instead of defining our own

68a3a7fc94833020403190c20bd9be186c6156ce by khng:
kasan: fix false-positive kasan_report upon thread reuse

The failed test cases:

4 tests failed.
FAILED:  sys.netinet.arp.static

Error Message:
atf-check failed; see the output of the test for details

FAILED:  usr.bin.unzip.functional_test.test_I

Error Message:
atf-check failed; see the output of the test for details

FAILED:  sys.kern.unix_seqpacket_test.random_eor_and_waitall

Error Message:
/usr/src/tests/sys/kern/unix_seqpacket_test.c:1182: send(params->sock, &params->sendbuf[off], len, flags) == len not met

FAILED:  sys.netinet6.divert.ipdivert_ip6_output_remote_success

Error Message:
1 != 0 (1 != 0)