FreeBSD-main-amd64-test - Build #25133 - Still Unstable

From: <>
Date: Fri, 19 Apr 2024 18:54:52 UTC
FreeBSD-main-amd64-test - Build #25133 (8993d785a261ee92528b44dae5a629ce389de412) - Still Unstable

Build information:
Full change log:
Full build log:

Status explanation:
"Unstable" - some tests are suspected being broken by the following changes
"Still Unstable" - the failing test cases have not been fixed by these
                   following changes and this is a notification to note that
                   these changes have not been fully tested by the CI system

Change summaries:
(Those commits are likely but not certainly responsible)

6b13e4cb3da28be82f9d3b8bd98e229ae107c73a by se:
ldconfig: small optimization

f221df6597df6b606102b329f36e20e0257308de by se:
ldconfig: use little-endian hints file on all architectures

170d0882903eb75b92cd10e9a1bcbe57a647ae7d by des:
adduser: Overhaul.

8993d785a261ee92528b44dae5a629ce389de412 by gbe:
expand.1: Fix markup for the '-t' option

The failed test cases:

4 tests failed.

Error Message:
/usr/local/lib/python3.9/multiprocessing/ EOFError

FAILED:  usr.bin.unzip.functional_test.test_I

Error Message:
atf-check failed; see the output of the test for details

FAILED:  sys.kern.unix_seqpacket_test.random_eor_and_waitall

Error Message:
/usr/src/tests/sys/kern/unix_seqpacket_test.c:1182: send(params->sock, &params->sendbuf[off], len, flags) == len not met

FAILED:  sys.netinet6.divert.ipdivert_ip6_output_remote_success

Error Message:
1 != 0 (1 != 0)