FreeBSD-stable-14-amd64-test - Build #514 - Still Unstable

From: <>
Date: Wed, 17 Apr 2024 17:20:49 UTC
FreeBSD-stable-14-amd64-test - Build #514 (ca8e2e4c91cc40ce963b9d82531a14beb1a95e5a) - Still Unstable

Build information:
Full change log:
Full build log:

Status explanation:
"Unstable" - some tests are suspected being broken by the following changes
"Still Unstable" - the failing test cases have not been fixed by these
                   following changes and this is a notification to note that
                   these changes have not been fully tested by the CI system

Change summaries:
(Those commits are likely but not certainly responsible)

2da45e304dba8004f953206a6fdfc4f801478251 by tuexen:
TCP LRO: convert TCP header fields to host byte order earlier

307daa4f1759ba93e618d09c6a4a0a869ad5fc27 by tuexen:
vnic: fix compilation of an IPv6 only kernel

8b2c694d383623a20edc7f64aaefcb28d06be9f6 by tuexen:
RACK, BBR: handle EACCES like EPERM for IP output handling

c5e78e553c6638fb24e7186690056fac9d78b2c9 by tuexen:
dtrace: allow NULL interface pointer for ifinfo_t translator

49557689bf1e0297377eac8b42e191a439291f57 by tuexen:
sctp: improve consistency

be7586fe468f5c3afbe8fc413e160bb9626d0497 by tuexen:
sctp: improve sending of packets containing an INIT ACK chunk

8244b35ff88c65a28bfc03d8a8d5ce56b7a023ce by tuexen:
TCP LRO: disable mbuf queuing when packet filter hooks are in place

d69099e4330e1e2c4aa7349a3ab3f4ce47e8dc42 by tuexen:
TCP LRO: add dtrace probe points

fd2a580db248502b5fd46867992e346a95298efe by tuexen:
tcp: no data on SYN segments unless doing TFO

fbc8dfd0ed80ba7d12d2683c8afecf6d16ce3388 by tuexen:
tcp bblog: use correct length

8375db082c6b486b05cd8072979d113512341fab by tuexen:
tcp hpts: improve consistency

be30b22fbb77b74c2be8de28266630d979fc61c3 by tuexen:
tcp: fix comment

7ebfafa813ce89b2082647eb1c9e136b527ce653 by tuexen:
tcp: fix conversion of rttvar

f3e2beb306c6778ab5d3c5774ad28643d939fad4 by tuexen:
tcp: address a warning

60898a7cef0b47efe4b2b81460fccfc2002b819a by tuexen:
tcp hpts: initialize variable

6572d12cfc67632127576c9e4ce16d7d433f122d by tuexen:
tcp bblog: cleanup

7a019565ff6dc6efb5c6ab091343740fd6dd0377 by tuexen:
uipc_socket: handle socket buffer locks in sopeeloff

c6770e8c99abade057bee6ef25f3c2e076ebdce1 by tuexen:
tcp rack: fix memory corruption

90cde57af8c6f14c9a898027646b8e5c6fdd1cfb by tuexen:
tcp: improve consistency

5344772af985cf95e48cffacdcd2cc19f8cdfbf5 by tuexen:
tcp: add some debug output

14d778433227adbcfafd7c120339f7ca27355810 by tuexen:
tcp bbr: improve code consistency

b5ee7411bfabaf85f226fdfc4f2d8e0515d66691 by tuexen:
tcp rack: fix sending

134884436681a8eaf23b26435153c637302482d7 by tuexen:
Revert "tcp rack: fix sending"

994f9c9e3c2cafc2182703c4a43580a2bd390f30 by tuexen:
tcp rack: fix sending

1f85f062768dd2c5be8bd78af56e72dd5f95950e by markj:
vm_reserv_reclaim_contig: Return NULL not false

ca8e2e4c91cc40ce963b9d82531a14beb1a95e5a by markj:
tcp: Make tcp_var.h more self-contained

The failed test cases:

5 tests failed.
FAILED:  sys.geom.class.gate.ggate_test.ggated

Error Message:
atf-check failed; see the output of the test for details


Error Message:
atf-check failed; see the output of the test for details

FAILED:  sys.netinet6.exthdr.exthdr

Error Message:
atf-check failed; see the output of the test for details

FAILED:  sys.netpfil.common.tos.pf_tos

Error Message:
atf-check failed; see the output of the test for details


Error Message:
Test program did not exit cleanly