FreeBSD-main-amd64-test - Build #25123 - Still Unstable

From: <>
Date: Wed, 17 Apr 2024 09:59:24 UTC
FreeBSD-main-amd64-test - Build #25123 (2fda3ab0ac1903a977ef5d39d4dfb2ffe86ff1b7) - Still Unstable

Build information:
Full change log:
Full build log:

Status explanation:
"Unstable" - some tests are suspected being broken by the following changes
"Still Unstable" - the failing test cases have not been fixed by these
                   following changes and this is a notification to note that
                   these changes have not been fully tested by the CI system

Change summaries:
(Those commits are likely but not certainly responsible)

de22251127cd0e89ce1edb56c58b202496a97ba3 by imp:
arm_kernel_bothdr.awk: Update to latest ota

67163bc485a56d960b72fb26f19685682b92dd6b by imp:
nvmecontrol: Create letoh to generically convert to host order

85656a9a015339f3d412e5b1888e798bb3e7d4ba by imp:
nvmecontrol: Make the error log page work on native format

e098d24b5290a9f59734587ded783c19d4dc6e31 by imp:
nvmecontrol: Have to truncate on all 32-bit architectures

1c4b7effa7f9df64bf72c6291b4719cffb2ffe22 by imp:
nvmecontrol: Fix to128 for big endian targets

729ee4c88f2af4560adec39fd709ff89bb597e4a by imp:
nvmecontrol: Move smart/health printing to little endian orderinng

acdf72f7bbe582b8eabf09576dc93eb4fcfbd19b by imp:
nvmecontrol: Move namespace change page printing to little endian

98f841efd8ce387d9cd060174b9dcc9ff9850648 by imp:
nvmecontrol: Move self test status page printing to little endian

b850caf7b7099636fd4323cb47a82f5201309fed by imp:
nvmecontrol: Move command effeccts page printing to little endian

3d28a9c608a382af669e22e9e8eda7fd0bc02cad by imp:
nvmecontrol: Move reservation notifcation page printing to little endian

55a1679ece1f56beda5f68e929a6b2fc553fb501 by imp:
nvmecontrol: Move sanitize status page printing to little endian

f0f7e9616da052e3d77b6e41301ccd655ae434fa by imp:
nvmecontrol: Move intel temperature page printing to little endian

97b77de2d951b4946fb3219a99c98f2dd4c0120f by imp:
nvme: Eliminate intel_log_temp_stats_swapbytes

e39873820da7ddfddb59823efc3421125b92c17a by imp:
nvmecontrol: add newlines where needed for ns command printfs

383a44fc0bcb36bf67127856f0c5fabfea522bab by imp:
nvmecontrol: Preliminary namespace documentation

98ab7d0a30f8d0fc9c51e1e97ac29f87750b526c by imp:
nvmecontrol: Add nvme 2.0 fields to read_logpage

49ea0889f2cb5e786e166fa9536c84f4a9994a6b by imp:
nvmecontrol: One file per line

2fda3ab0ac1903a977ef5d39d4dfb2ffe86ff1b7 by imp:
WITH_NVME: Remove from broken.

The failed test cases:

5 tests failed.
FAILED:  sys.netinet6.lpm6.lpm6_test2_success

Error Message:
atf-check failed; see the output of the test for details

FAILED:  lib.libarchive.functional_test.test_compat_lzip

Error Message:
atf-check failed; see the output of the test for details

FAILED:  usr.bin.unzip.functional_test.test_I

Error Message:
atf-check failed; see the output of the test for details

FAILED:  sys.kern.unix_seqpacket_test.random_eor_and_waitall

Error Message:
/usr/src/tests/sys/kern/unix_seqpacket_test.c:1182: send(params->sock, &params->sendbuf[off], len, flags) == len not met

FAILED:  sys.netinet6.divert.ipdivert_ip6_output_remote_success

Error Message:
1 != 0 (1 != 0)