FreeBSD-main-amd64-test - Build #25114 - Still Unstable

From: <>
Date: Tue, 16 Apr 2024 16:19:33 UTC
FreeBSD-main-amd64-test - Build #25114 (428f86fd2ff1fd2b073d556fac273c8c7f457376) - Still Unstable

Build information:
Full change log:
Full build log:

Status explanation:
"Unstable" - some tests are suspected being broken by the following changes
"Still Unstable" - the failing test cases have not been fixed by these
                   following changes and this is a notification to note that
                   these changes have not been fully tested by the CI system

Change summaries:
(Those commits are likely but not certainly responsible)

428f86fd2ff1fd2b073d556fac273c8c7f457376 by markj:
mv: Set file flags after setting file times

The failed test cases:

3 tests failed.
FAILED:  sys.netpfil.common.dummynet.pf_pls_gilbert

Error Message:
atf-check failed; see the output of the test for details

FAILED:  sys.kern.unix_seqpacket_test.random_eor_and_waitall

Error Message:
/usr/src/tests/sys/kern/unix_seqpacket_test.c:1182: send(params->sock, &params->sendbuf[off], len, flags) == len not met

FAILED:  sys.netinet6.divert.ipdivert_ip6_output_remote_success

Error Message:
1 != 0 (1 != 0)