FreeBSD-main-amd64-test - Build #25111 - Still Unstable

From: <>
Date: Tue, 16 Apr 2024 09:37:25 UTC
FreeBSD-main-amd64-test - Build #25111 (f750dce972efaea614aa6d03ecdb24aa962a38a4) - Still Unstable

Build information:
Full change log:
Full build log:

Status explanation:
"Unstable" - some tests are suspected being broken by the following changes
"Still Unstable" - the failing test cases have not been fixed by these
                   following changes and this is a notification to note that
                   these changes have not been fully tested by the CI system

Change summaries:
(Those commits are likely but not certainly responsible)

f750dce972efaea614aa6d03ecdb24aa962a38a4 by royger:
x86/xen: fix accounted interrupt time

The failed test cases:

3 tests failed.
FAILED:  sys.netinet.libalias.2_natout.8_portrange

Error Message:
1 checks failed; see output for more details

FAILED:  sys.kern.unix_seqpacket_test.random_eor_and_waitall

Error Message:
/usr/src/tests/sys/kern/unix_seqpacket_test.c:1182: send(params->sock, &params->sendbuf[off], len, flags) == len not met

FAILED:  sys.netinet6.divert.ipdivert_ip6_output_remote_success

Error Message:
1 != 0 (1 != 0)