FreeBSD-main-amd64-test - Build #25108 - Still Unstable

From: <>
Date: Mon, 15 Apr 2024 22:28:39 UTC
FreeBSD-main-amd64-test - Build #25108 (3f115b864b1fba951ce60970b5febb4e593b1f77) - Still Unstable

Build information:
Full change log:
Full build log:

Status explanation:
"Unstable" - some tests are suspected being broken by the following changes
"Still Unstable" - the failing test cases have not been fixed by these
                   following changes and this is a notification to note that
                   these changes have not been fully tested by the CI system

Change summaries:
(Those commits are likely but not certainly responsible)

1665ef979d3adab05d178480077674ab5978e4f0 by bz:
LinuxKPI: 802.11: disable early queue wakeup workaround; better classify

3f115b864b1fba951ce60970b5febb4e593b1f77 by bz:
git/ allow comments in exclude file

The failed test cases:

3 tests failed.
FAILED:  sys.kqueue.libkqueue.kqueue_test.main

Error Message:
Returned non-success exit status 1

FAILED:  sys.kern.unix_seqpacket_test.random_eor_and_waitall

Error Message:
/usr/src/tests/sys/kern/unix_seqpacket_test.c:1182: send(params->sock, &params->sendbuf[off], len, flags) == len not met

FAILED:  sys.netinet6.divert.ipdivert_ip6_output_remote_success

Error Message:
1 != 0 (1 != 0)