FreeBSD-main-amd64-test - Build #25099 - Still unstable

From: <>
Date: Sun, 14 Apr 2024 10:27:24 UTC
FreeBSD-main-amd64-test - Build #25099 (51c69c8682e8ab0e5d82ab3d6f2d16419d40bad4) - Still unstable

Build information:
Full change log:
Full build log:

Status explanation:
"Unstable" - some tests are suspected being broken by the following changes
"Still Unstable" - the failing test cases have not been fixed by these
                   following changes and this is a notification to note that
                   these changes have not been fully tested by the CI system

Change summaries:
(Those commits are likely but not certainly responsible)

51c69c8682e8ab0e5d82ab3d6f2d16419d40bad4 by delphij:
amdsmn(4), amdtemp(4): add support for AMD Family 19h Models 10h-1Fh.

The failed test cases:

4 tests failed.
FAILED:  sys.netinet6.ndp.ndp_del_gu_success

Error Message:
atf-check failed; see the output of the test for details

FAILED:  sys.kern.unix_passfd_stream.empty_rights_message

Error Message:
/usr/src/tests/sys/kern/unix_passfd_test.c:906: len == -1 && errno == EINVAL not met

FAILED:  sys.kern.unix_seqpacket_test.random_eor_and_waitall

Error Message:
/usr/src/tests/sys/kern/unix_seqpacket_test.c:1182: send(params->sock, &params->sendbuf[off], len, flags) == len not met

FAILED:  sys.netinet6.divert.ipdivert_ip6_output_remote_success

Error Message:
1 != 0 (1 != 0)