FreeBSD-main-amd64-test - Build #25095 - Still Unstable

From: <>
Date: Sat, 13 Apr 2024 19:58:56 UTC
FreeBSD-main-amd64-test - Build #25095 (068c675ca7aec11d3546c3f908e842a7eca2ccae) - Still Unstable

Build information:
Full change log:
Full build log:

Status explanation:
"Unstable" - some tests are suspected being broken by the following changes
"Still Unstable" - the failing test cases have not been fixed by these
                   following changes and this is a notification to note that
                   these changes have not been fully tested by the CI system

Change summaries:
(Those commits are likely but not certainly responsible)

068c675ca7aec11d3546c3f908e842a7eca2ccae by christos:
sound: Remove leftover references to snd_clone

The failed test cases:

3 tests failed.
FAILED:  sys.kern.unix_passfd_stream.empty_rights_message

Error Message:
/usr/src/tests/sys/kern/unix_passfd_test.c:906: len == -1 && errno == EINVAL not met

FAILED:  sys.kern.unix_seqpacket_test.random_eor_and_waitall

Error Message:
/usr/src/tests/sys/kern/unix_seqpacket_test.c:1182: send(params->sock, &params->sendbuf[off], len, flags) == len not met

FAILED:  sys.netinet6.divert.ipdivert_ip6_output_remote_success

Error Message:
1 != 0 (1 != 0)