FreeBSD-main-amd64-test - Build #25087 - Still Unstable

From: <>
Date: Thu, 11 Apr 2024 21:53:01 UTC
FreeBSD-main-amd64-test - Build #25087 (ec8a394d9c676b3c4fd2cd721cf554e073736fc1) - Still Unstable

Build information:
Full change log:
Full build log:

Status explanation:
"Unstable" - some tests are suspected being broken by the following changes
"Still Unstable" - the failing test cases have not been fixed by these
                   following changes and this is a notification to note that
                   these changes have not been fully tested by the CI system

Change summaries:
(Those commits are likely but not certainly responsible)

f6df79ab8d36176c91219840729baa56d738c9ba by imp:
msan: Fix typo

73bb5aea88da5c02676ad606c215f442d35e68e8 by imp:
atomic: Fix typo

1eedb4e592650889d0eff7afef536e454e576f86 by imp:
vmm: Fix typo

b8d29d68c46cbe7ab822889de8f2fd963150ed1c by imp:
pmap: Fix typos

ca4ceadbe542ac35a0dd73d71b185f8384d5e036 by imp:
minidump_machdep: Fix typo

8551c31b2eee1bb10ad6bbd38f413e483447fc6f by imp:
exception: Fix typos

33afe704bf1797b3720c4d45e7a8dcf1f0794110 by imp:
sigtramp: Fix typo

8d66b134f36e975efedfda7ca8d15ff4fc37063a by imp:
vmm/x86: Fix typo

ef764e4801cc503303ae264fe6b005ae3640bbbe by imp:
vhpet: Fix typo

c1aa50bf31c975d264d3eb5206cab950b50593ea by imp:
specialreg: Fix typos

f092a54fdc6d394d510451ed0429f78abe0f3a55 by imp:
Makefile.inc1: Fix typo

5ef49c7820d3d79404a28d182ab8401866dfd751 by imp:
zonectl: Fix a typo

068e918057a5cebfdc2f95c6923ff263c983eb5d by imp:
manctl: Fix typo

e57d2e4aeeb98d08df38f1d514e5f93d523826e9 by imp:
crunch: Fix typo

dc8725726d0205c10b01c06717cb265ab7d239e5 by imp:
pnfsdscopymr: Fix typos

6addf2595e5ea95d7cc45233ca44c3faa09520b7 by imp:
inetd: Fix typos

c384235c16330cb48c3b0b02ff821ff0915bd2a4 by imp:
mergemaster: Fix typo

d600ad8101d44906af74620f5f53bac97faff319 by imp:
ipfw: Remove repeated words

5e2a419256b7effb67b72796f68f9d23ea68fea5 by imp:
include: Remove repeated words

f7cee4fa57a2b52a6e43a1f820ce7ba891b8e7d9 by imp:
sbin: Remove repeated words

ec8a394d9c676b3c4fd2cd721cf554e073736fc1 by imp:
usr.sbin: Remove repeated words

The failed test cases:

4 tests failed.
FAILED:  sys.kern.unix_passfd_stream.empty_rights_message

Error Message:
/usr/src/tests/sys/kern/unix_passfd_test.c:906: len == -1 && errno == EINVAL not met

FAILED:  sys.kern.unix_seqpacket_test.random_eor_and_waitall

Error Message:
/usr/src/tests/sys/kern/unix_seqpacket_test.c:1182: send(params->sock, &params->sendbuf[off], len, flags) == len not met

FAILED:  sys.netinet6.divert.ipdivert_ip6_output_remote_success

Error Message:
1 != 0 (1 != 0)

FAILED:  cddl.usr.sbin.zfsd.zfsd_unittest.main

Error Message:
Received signal 6