FreeBSD-main-amd64-test - Build #25085 - Still Unstable

From: <>
Date: Thu, 11 Apr 2024 18:52:42 UTC
FreeBSD-main-amd64-test - Build #25085 (eeec7a1199d0ce913b40fedb9d7e0d08d3f4f9c4) - Still Unstable

Build information:
Full change log:
Full build log:

Status explanation:
"Unstable" - some tests are suspected being broken by the following changes
"Still Unstable" - the failing test cases have not been fixed by these
                   following changes and this is a notification to note that
                   these changes have not been fully tested by the CI system

Change summaries:
(Those commits are likely but not certainly responsible)

52f3d650894d84a7986f915dba75823c5b3c1249 by markj:
arm64/vmm: Define a dummy _start symbol in vmm_hyp_blob.elf

eeec7a1199d0ce913b40fedb9d7e0d08d3f4f9c4 by bapt:
Revert "cloudware: allow disk format to be a list"

The failed test cases:

4 tests failed.
FAILED:  sys.kern.unix_passfd_stream.empty_rights_message

Error Message:
/usr/src/tests/sys/kern/unix_passfd_test.c:906: len == -1 && errno == EINVAL not met

FAILED:  sys.kern.unix_seqpacket_test.random_eor_and_waitall

Error Message:
/usr/src/tests/sys/kern/unix_seqpacket_test.c:1182: send(params->sock, &params->sendbuf[off], len, flags) == len not met

FAILED:  sys.netinet6.divert.ipdivert_ip6_output_remote_success

Error Message:
1 != 0 (1 != 0)

FAILED:  cddl.usr.sbin.zfsd.zfsd_unittest.main

Error Message:
Received signal 6