FreeBSD-main-amd64-test - Build #25070 - Still Unstable

From: <>
Date: Wed, 10 Apr 2024 06:41:02 UTC
FreeBSD-main-amd64-test - Build #25070 (2c01e189ff190cf1618dedd01f196bca68298c44) - Still Unstable

Build information:
Full change log:
Full build log:

Status explanation:
"Unstable" - some tests are suspected being broken by the following changes
"Still Unstable" - the failing test cases have not been fixed by these
                   following changes and this is a notification to note that
                   these changes have not been fully tested by the CI system

Change summaries:
(Those commits are likely but not certainly responsible)

ac83063d37e5e92ad048cc4ed958654c02103f74 by imp:
bcm2838_xhci: add module

93e4813b9a157396ffbcf8456ca4f5c25599807d by cperciva:
release: make -j compat: cd inside subshell

65c603ed65c700d6eacdf9e1e94dc42fd70fb0b7 by cperciva:
release: distributekernel before packagekernel

a1bff97300abe4b46528357e39c83da764df1fd8 by cperciva:
release: Don't reuse disc1/bootonly directories

2c01e189ff190cf1618dedd01f196bca68298c44 by cperciva:
Reapply " Add -jN to `make release`"

The failed test cases:

8 tests failed.

Error Message:
/usr/src/tests/sys/audit/network.c:1053: 0 != sendfile(filedesc, sockfd, 0, 0, NULL, NULL, 0)

FAILED:  sys.capsicum.functional.test_root

Error Message:
atf-check failed; see the output of the test for details

FAILED:  sys.capsicum.functional.test_unprivileged

Error Message:
atf-check failed; see the output of the test for details


Error Message:
Returned non-success exit status 1

FAILED:  sys.kern.unix_passfd_stream.empty_rights_message

Error Message:
/usr/src/tests/sys/kern/unix_passfd_test.c:906: len == -1 && errno == EINVAL not met

FAILED:  sys.kern.unix_seqpacket_test.random_eor_and_waitall

Error Message:
/usr/src/tests/sys/kern/unix_seqpacket_test.c:1182: send(params->sock, &params->sendbuf[off], len, flags) == len not met

FAILED:  sys.netinet6.divert.ipdivert_ip6_output_remote_success

Error Message:
1 != 0 (1 != 0)

FAILED:  cddl.usr.sbin.zfsd.zfsd_unittest.main

Error Message:
Received signal 6