FreeBSD-main-amd64-test - Build #25068 - Still Unstable

From: <>
Date: Wed, 10 Apr 2024 02:03:51 UTC
FreeBSD-main-amd64-test - Build #25068 (b18029bc59d2ed6b0eeeb233189cf713b34b467c) - Still Unstable

Build information:
Full change log:
Full build log:

Status explanation:
"Unstable" - some tests are suspected being broken by the following changes
"Still Unstable" - the failing test cases have not been fixed by these
                   following changes and this is a notification to note that
                   these changes have not been fully tested by the CI system

Change summaries:
(Those commits are likely but not certainly responsible)

973d3a82096bc135f6c230e348e2f33c382096bc by jhb:
NOTES: Move OFED options to MI NOTES

60bb979b3c3224f01e96f7e3c92a270977d2587b by jhb:
iser: Add kernel build glue

76f22e353f66d9ec1c1bea1d72eeec56078d4728 by jhb:
NOTES: Add devices for iSCSI support

a508f5d92a93cda11b0c68084dbb181f97e7f5f7 by jhb:
NOTES: Tidy entries for SATA controllers

16e846fa1ed3c97419b55b292f77b0f4209f0875 by jhb:
sys: Enable NVMe drivers on all architectures

8f7105a20697d47060dbedc966cf085a64aeced6 by jhb:
NOTES: Move NVMe entries to MI file

b18029bc59d2ed6b0eeeb233189cf713b34b467c by jah:
unionfs_lookup(): fix wild accesses to vnode private data

The failed test cases:

8 tests failed.

Error Message:
/usr/src/tests/sys/audit/network.c:1053: 0 != sendfile(filedesc, sockfd, 0, 0, NULL, NULL, 0)

FAILED:  sys.capsicum.functional.test_root

Error Message:
atf-check failed; see the output of the test for details

FAILED:  sys.capsicum.functional.test_unprivileged

Error Message:
atf-check failed; see the output of the test for details


Error Message:
Returned non-success exit status 1

FAILED:  sys.kern.unix_passfd_stream.empty_rights_message

Error Message:
/usr/src/tests/sys/kern/unix_passfd_test.c:906: len == -1 && errno == EINVAL not met

FAILED:  sys.kern.unix_seqpacket_test.random_eor_and_waitall

Error Message:
/usr/src/tests/sys/kern/unix_seqpacket_test.c:1182: send(params->sock, &params->sendbuf[off], len, flags) == len not met

FAILED:  sys.netinet6.divert.ipdivert_ip6_output_remote_success

Error Message:
1 != 0 (1 != 0)

FAILED:  cddl.usr.sbin.zfsd.zfsd_unittest.main

Error Message:
Received signal 6