FreeBSD-stable-14-amd64-test - Build #477 - Still Unstable

From: <>
Date: Mon, 08 Apr 2024 06:40:57 UTC
FreeBSD-stable-14-amd64-test - Build #477 (2bfda18ff7bfbf8e3710c15aa312f6e9d2e7cb66) - Still Unstable

Build information:
Full change log:
Full build log:

Status explanation:
"Unstable" - some tests are suspected being broken by the following changes
"Still Unstable" - the failing test cases have not been fixed by these
                   following changes and this is a notification to note that
                   these changes have not been fully tested by the CI system

Change summaries:
(Those commits are likely but not certainly responsible)

a9288701dee1dc0e696d0a9d858f8a5287beff66 by delphij:
Revert "MFV: xz 5.6.0"

2bfda18ff7bfbf8e3710c15aa312f6e9d2e7cb66 by delphij:
Backport export of lzma_mt_block_size symbol.

The failed test cases:

5 tests failed.
FAILED:  sys.kern.ptrace_test.ptrace__follow_fork_parent_detached_unrelated_debugger

Error Message:
/usr/src/tests/sys/kern/ptrace_test.c:592: WIFSTOPPED(status) not met

FAILED:  sys.netinet6.exthdr.exthdr

Error Message:
atf-check failed; see the output of the test for details


Error Message:
/usr/local/lib/python3.9/multiprocessing/ EOFError

FAILED:  sys.fs.tmpfs.times_test.empty

Error Message:
Test case was expecting a failure but none were raised


Error Message:
Test program did not exit cleanly