FreeBSD-main-amd64-test - Build #25037 - Still Unstable

From: <>
Date: Wed, 03 Apr 2024 19:56:42 UTC
FreeBSD-main-amd64-test - Build #25037 (584e1c355ae3c994331005b7196cc87a714e5317) - Still Unstable

Build information:
Full change log:
Full build log:

Status explanation:
"Unstable" - some tests are suspected being broken by the following changes
"Still Unstable" - the failing test cases have not been fixed by these
                   following changes and this is a notification to note that
                   these changes have not been fully tested by the CI system

Change summaries:
(Those commits are likely but not certainly responsible)

b1fd95c9e24791d44593e611406b41e57826a5b8 by des:
tarfs: Support paths that spill into exthdrs.

584e1c355ae3c994331005b7196cc87a714e5317 by des:
tarfs: Ignore global extended headers.

The failed test cases:

4 tests failed.
FAILED:  sys.kqueue.libkqueue.kqueue_test.main

Error Message:
Received signal 6

FAILED:  sys.netpfil.common.dummynet.pf_pls_gilbert

Error Message:
atf-check failed; see the output of the test for details

FAILED:  sys.fs.tmpfs.times_test.empty

Error Message:
Test case was expecting a failure but none were raised

FAILED:  cddl.usr.sbin.zfsd.zfsd_unittest.main

Error Message:
Received signal 6