FreeBSD-main-amd64-test - Build #25027 - Still Unstable

From: <>
Date: Wed, 03 Apr 2024 05:50:32 UTC
FreeBSD-main-amd64-test - Build #25027 (125c4560bc70971b950d035cfcd2255b89984011) - Still Unstable

Build information:
Full change log:
Full build log:

Status explanation:
"Unstable" - some tests are suspected being broken by the following changes
"Still Unstable" - the failing test cases have not been fixed by these
                   following changes and this is a notification to note that
                   these changes have not been fully tested by the CI system

Change summaries:
(Those commits are likely but not certainly responsible)

125c4560bc70971b950d035cfcd2255b89984011 by des:
usr.bin: Make lorder conditional on MK_TOOLCHAIN.

The failed test cases:

3 tests failed.
FAILED:  sys.netpfil.common.dummynet.pf_pls_gilbert

Error Message:
atf-check failed; see the output of the test for details

FAILED:  sys.fs.tmpfs.times_test.empty

Error Message:
Test case was expecting a failure but none were raised

FAILED:  cddl.usr.sbin.zfsd.zfsd_unittest.main

Error Message:
Received signal 6