FreeBSD-main-amd64-test - Build #25021 - Still Unstable

From: <>
Date: Tue, 02 Apr 2024 20:50:00 UTC
FreeBSD-main-amd64-test - Build #25021 (783d3ff6d7fae619db8a7990b8a6387de0c677b5) - Still Unstable

Build information:
Full change log:
Full build log:

Status explanation:
"Unstable" - some tests are suspected being broken by the following changes
"Still Unstable" - the failing test cases have not been fixed by these
                   following changes and this is a notification to note that
                   these changes have not been fully tested by the CI system

Change summaries:
(Those commits are likely but not certainly responsible)

90ff732358390ac395999577b703dcb4d3e0df59 by noreply:
freebsd: fix missing headers in distribution tarball

ef08a4d4065d21414d7fedccac20da6bfda4dfd0 by noreply:
Linux 6.8 compat: use splice_copy_file_range() for fallback

45e23abed55cc1c7216e98df28f1b6c6f172b790 by noreply:
Update resume token at object receive.

c9d8f6c59a268f65075bb9e510a58b1eec8015f7 by noreply:
Fix option string, adding -e and fixing order

5c4a4f82c850be6540076ff794d25defd826dddf by noreply:
zio: update ZIO type x stage documentation

2c01cae8b9faca5766629aa45b2bfabaeae92e4d by noreply:
BRT: Change brt_pending_tree sorting order

f1b368359b3970f7995a6dcb088fdadb31840f4d by noreply:
udev: correctly handle partition #16 and later

c28f94f32ef0f104b731be0e44c5e61bbdf3b9b7 by noreply:
ZAP: Some cleanups/micro-optimizations

102b468b5e190973fbaee6fe682727eb33079811 by noreply:
Fix corruption caused by mmap flushing problems

bf8f72359d1bf0cdb6a4b31ccfc7bbef0f948ca4 by noreply:
BRT: Skip duplicate BRT prefetches

80cc516295fef1a429542fcfeea369c6bbb85ce4 by noreply:
ZAP: Massively switch to _by_dnode() interfaces

4616b96a643c941e96ee0d1d816c573df9f0de28 by noreply:
BRT: Relax brt_pending_apply() locking

493fcce9be165bd751434879d2478938cd5bb926 by noreply:
Provide macros for setting and getting blkptr birth times

f68bde7236699353b89de176fd35f7fa92bfc30b by noreply:
BRT: Make BRT block sizes configurable

df04efe321a49c650f1fbaa6fd701fa2928cbe21 by behlendorf1:
linux 5.4 compat: page_size()

390b448726c580999dd337be7a40b0e95cf1d50b by behlendorf1:
abd: add page iterator

f3b85d706bae82957d2e3e0ef1d53a1cfab60eb4 by behlendorf1:
vdev_disk: rename existing functions to vdev_classic_*

867178ae1db28e73051c8a7ce662f2f2f81cd8e6 by behlendorf1:
vdev_disk: reorganise vdev_disk_io_start

c4a13ba483f08a81aa47479d2f763a470d95b2b0 by behlendorf1:
vdev_disk: make read/write IO function configurable

06a196020e6f70d2fedbd4d0d05bbe0c1ac6e4d8 by behlendorf1:
vdev_disk: rewrite BIO filling machinery to avoid split pages

df2169d141aadc0c2cc728c5c5261d6f5c2a27f7 by behlendorf1:
vdev_disk: add module parameter to select BIO submission method

72fd834c47558cb10d847948d1a4615e894c77c3 by behlendorf1:
vdev_disk: use bio_chain() to submit multiple BIOs

c6be6ce1755a3d9a3cbe70256cd8958ef83d8542 by behlendorf1:
abd_iter_page: don't use compound heads on Linux <4.5

8cd8ccca5383dcdd9bf55d4d22921a6b43b4ebe1 by noreply:
BRT: Skip getting length in brt_entry_lookup()

a89d209bb60c3f32881da7624bd01d28023da4f4 by behlendorf1:
BRT: Fix holes cloning.

b4034276247bfe430a7ff8d8ef9b06826e83cb9d by behlendorf1:
BRT: Fix tests to work on non-empty pools

0c8eb974ff3bba965d7303d3fa7db2007ef4bdfa by behlendorf1:
BRT: Check pool clone stats in more tests

e39e20b6dc73bd7df1f097c23b5297bcc989ed53 by noreply:
ZTS: fix flakiness in cp_files_002_pos

b1e46f869e773086c23c565d7d5b261577023cfb by noreply:
Add ashift validation when adding devices to a pool

c0aab8b8f91f5ecb2c625a8fa7265f26c260e10a by noreply:
zvols: prevent overflow of minor device numbers

cfb96c772b8448dca6eaeb66a540b8bb39c9908c by noreply:
vdev_disk: clean up spa/bdev mode conversion

2553f94c4299aaf31c5ceea4bfbfcc811cf76513 by noreply:
Fix buffer underflow if sysfs file is empty

39be46f43f96fb7420386d03751b01f5cb376d6b by noreply:
Linux 5.18+ compat: Detect filemap_range_has_page

e0388a906ca77d07c99e8762d47dccaaaefd8bab by alc:
arm64: enable superpage mappings by pmap_mapdev{,_attr}()

The failed test cases:

3 tests failed.
FAILED:  sys.netpfil.common.dummynet.pf_queue

Error Message:
We failed prioritisation 1 times

FAILED:  sys.fs.tmpfs.times_test.empty

Error Message:
Test case was expecting a failure but none were raised

FAILED:  cddl.usr.sbin.zfsd.zfsd_unittest.main

Error Message:
Received signal 6