FreeBSD-main-amd64-test - Build #25013 - Still Unstable

From: <>
Date: Mon, 01 Apr 2024 00:07:07 UTC
FreeBSD-main-amd64-test - Build #25013 (b5e55dbf357472ffa39345b30b8b781e988a440f) - Still Unstable

Build information:
Full change log:
Full build log:

Status explanation:
"Unstable" - some tests are suspected being broken by the following changes
"Still Unstable" - the failing test cases have not been fixed by these
                   following changes and this is a notification to note that
                   these changes have not been fully tested by the CI system

Change summaries:
(Those commits are likely but not certainly responsible)

fba54d0179aabb3d94211ca80f94fe5b98ac6d3b by christos:
sound: Drain buffer selinfo in sndbuf_free()

6d1cee1640e1c360917e483ece5ec1bde423b788 by christos:
sound: Get rid of pcm/sndstat.h and turn macros into regular code

c136e6180e4762c1180d89cd2291fd9a935a721d by christos:
sound: Fix SND_DIAGNOSTIC ifdef comment

b5e55dbf357472ffa39345b30b8b781e988a440f by christos:
sound: Remove unused SND_DEV_LAST and SND_DEV_MAX constants

The failed test cases:

3 tests failed.
FAILED:  sys.netinet6.ndp.ndp_del_gu_success

Error Message:
atf-check failed; see the output of the test for details

FAILED:  sys.fs.tmpfs.times_test.empty

Error Message:
Test case was expecting a failure but none were raised

FAILED:  cddl.usr.sbin.zfsd.zfsd_unittest.main

Error Message:
Received signal 6